[Kolab-devel] [issue2386] Kolab 2.2 Beta 3 - Bad exit status while installing

Thomas Funk kolab-issues at intevation.de
Tue Jan 8 21:32:09 CET 2008

New submission from Thomas Funk <t.funk at web.de>:


I have problems to install Kolab 2.2 Beta 3 on Fedora 7. I got the following errors:

libbackend.a(fold-const.o): In function `int_const_binop':
fold-const.c:(.text+0x2f50): multiple definition of `int_const_binop'
collect2: ld returned 1 exit status
make[3]: *** [cc1-dummy] Error 1
make[2]: *** [all-stage2-gcc] Error 2
make[1]: *** [stage2-bubble] Error 2
make: *** [bootstrap-lean] Error 2
error: Bad exit status from /kolab/RPM/TMP/rpm-tmp.59109 (%build)

RPM build errors:
    Bad exit status from /kolab/RPM/TMP/rpm-tmp.59109 (%build)

What's happening? Could it be that on the system gcc  4.1.2 20070925 (Red Hat
4.1.2-27) is installed but in the kolab package gcc 4.2.2 is used?

Attached is the kolab-install.log



messages: 13323
nosy: tf
priority: urgent
status: unread
title: Kolab 2.2 Beta 3 -  Bad exit status while installing
topic: server
Kolab issue tracker <kolab-issues at intevation.de>

More information about the devel mailing list