compile error on kolab-server-2.3.4 / Ubuntu 10.04

Stephen More stephen.more at
Mon Dec 19 17:23:38 CET 2011

There seemed to be many issues with kolab on Ubuntu 11.10 so I am
falling back to Ubuntu 10.04.

I get much further in the build process but I end up with:

  CXX    SelectionDAGBuilder.lo
  CXX    SelectionDAGISel.lo
  CXX    SelectionDAGPrinter.lo
  CXX    TargetLowering.lo
g++: Internal error: Killed (program cc1plus)
Please submit a full bug report.
See <URL:> for instructions.
make[5]: *** [LiveIntervalAnalysis.lo] Error 1
make[5]: *** Waiting for unfinished jobs....
make[4]: *** [all] Error 2
make[3]: *** [all-recursive] Error 1
make[2]: *** [all] Error 2
make[1]: *** [all-recursive] Error 1
make: *** [all] Error 2
error: Bad exit status from /kolab/RPM/TMP/rpm-tmp.15616 (%build)

What is the proper way to submit this bug ? I did not find any instructions.

-Stephen More

More information about the users mailing list