Installation Error on SuSE 9.1 x86_64

GeoIT info at
Tue Apr 26 14:35:40 CEST 2005

Dear Kolab experts,
I have problems installing Beta 5 on a SuSE 9.1 (Kernel 2.6.4-54.5-default)
It fails during compile of gcc:

checking for inttypes.h... (cached) yes
checking gconv.h usability... yes
checking gconv.h presence... yes
checking for gconv.h... yes
checking for sys/types.h... (cached) yes
checking for g++ that supports -ffunction-sections -fdata-sections... yes
checking for sin in -lm... configure: error: Link tests are not allowed
make[1]: *** [configure-target-libstdc++-v3] Error 1
make: *** [bootstrap-lean] Error 2
error: Bad exit status from /kolab/RPM/TMP/rpm-tmp.44972 (%build)

RPM build errors:
    Bad exit status from /kolab/RPM/TMP/rpm-tmp.44972 (%build)
obmtool:WARNING: install failure. Missing

Since I'm not a C programmer I have no clue where to start investigating.
Any hints ?

Andreas Paukner-Ruzicka

Geo-IT GmbH   -   Geoinformatik, IT-Services
Guggenberg 3, D-82380 Peissenberg
Tel: 08803-498372, Fax: 08803-498373
eMail: info at  -  Homepage:

More information about the users mailing list