[Kolab-devel] Kontact compile error

Stephan Buys list at codefusion.co.za
Thu Nov 18 11:07:33 CET 2004

Hi guys,

Running into the following error on SuSE 9.1:

 /bin/sh ../libtool --silent --mode=compile --tag=CXX g++ -DHAVE_CONFIG_H -I.-I. -I.. -I../libkdenetwork -I../libkdepim -I../libkpimidentities -I../libksieve -I../mimelib -I../certmanager/lib -I.. -I../libkdenetwork/libgpgme-copy/gpgme -I../libkdenetwork/libgpg-error-copy -I../libkdenetwork/libgpg-error-copy -I/opt/kde3/include -I/usr/lib/qt3/include -I/usr/X11R6/include   -DQT_THREAD_SUPPORT-D_REENTRANT -D_FILE_OFFSET_BITS=64  -Wnon-virtual-dtor -Wno-long-long -Wundef -ansi -D_XOPEN_SOURCE=500 -D_BSD_SOURCE -Wcast-align -Wconversion -Wchar-subscripts -Wall -W -Wpointer-arith -Wwrite-strings -O2 -Wformat-security -Wmissing-format-attribute -fno-exceptions -fno-check-new -fno-common -DQT_CLEAN_NAMESPACE -DQT_NO_ASCII_CAST -DQT_NO_STL -DQT_NO_COMPAT -DQT_NO_TRANSLATION  -MT configuredialog_p.lo -MD -MP -MF ".deps/configuredialog_p.Tpo" -c -o configuredialog_p.lo configuredialog_p.cpp; \
then mv -f ".deps/configuredialog_p.Tpo" ".deps/configuredialog_p.Plo"; else rm-f ".deps/configuredialog_p.Tpo"; exit 1; fi
In file included from configuredialog_p.cpp:419:
configuredialog_p.moc: In member function `virtual bool
   MiscPageGroupwareTab::qt_invoke(int, QUObject*)':
configuredialog_p.moc:2736: error: `slotLegaceBodyInvitesToggled' undeclared
   (first use this function)
configuredialog_p.moc:2736: error: (Each undeclared identifier is reported only
   once for each function it appears in.)
make[3]: *** [configuredialog_p.lo] Error 1

Is this supposed to work on SuSE 9.1 still? Any special caveats?


More information about the devel mailing list