Can't build 2.2-rc3 - fails tar 1.19 from openpkg

Johannes Graumann johannes_graumann at
Mon Jun 9 22:10:30 CEST 2008


I tried to send this earlier, but the attached install log was too big ...
I'm trying to build a pristine 2.2-rc3 from scratch. All md5sums pass, but if I
call the installation script as advised by the readme, it breaks while
processing tar 1.19 with the error below. Did anybody ever run into this? Fixes?

Thanks, Joh

../lib/libtar.a(argp-eexst.o): In function `argp_usage':
/tmp/openpkg-20071227/tar-1.19/lib/argp.h:588: multiple definition of 
tar.o:/tmp/openpkg-20071227/tar-1.19/src/../lib/argp.h:588: first defined
collect2: ld returned 1 exit status
make[2]: *** [tar] Error 1
make[2]: Leaving directory `/tmp/openpkg-20071227/tar-1.19/src'
make[1]: *** [all-recursive] Error 1
make[1]: Leaving directory `/tmp/openpkg-20071227/tar-1.19'
make: *** [all] Error 2
+ exit 2
+ exit 2
./openpkg.boot:ERROR: script returned non-null value

More information about the users mailing list